{"text_format":"1","workbook":"xlsx","n_sheets":11,"sheets":["1_Cartiglio ","2_INDICE","3_SCHEMA","4-INFORMAZIONI RISULTATI AZIONI","5-VdR_PdM","6-VdR_processo","7-OPPORTUNITA","8-VERIFICA PARTE TERZA_BOZZA ","Foglio1","modifiche","RIASSUNTO"],"not_rendered":{"charts":0,"images":2,"macros":1,"external_links":9,"defined_names":250,"comments":0,"pivot_tables":0},"unopened":[],"bounds":{"document_bytes":16777216,"sheet_cells":100000,"rows_first":2000,"rows_last":500,"rows_between":2000,"halvings":0,"cell_chars":16384,"cell_head_chars":4096},"cells_cut":0,"cells_raw":0,"read":"whole","date_system":"1900"}

{"sheet":"1_Cartiglio ","index":0,"n_rows":41,"n_cols":18,"rows_kept":41,"cut":false,"hidden":false,"merged":[[13,1,13,18],[42,1,42,6],[77,0,77,6],[18,1,18,18],[21,1,22,18],[24,1,25,18],[27,1,28,18],[33,1,33,18],[35,1,35,18],[36,1,36,18],[5,2,5,18],[0,0,4,1],[0,2,1,16],[0,17,4,18],[2,2,2,16],[3,2,4,16]]}
[null,null,"Valutazione del rischio (VdR)",null,null,null,null,null,null,null,null,null,null,null,null,null,null,{"$f":"A8&\"                                    Pagina \"&B9&\"  di \"&B10&\"                                         \"&A11&B11&\"                                    \"&A12&B12","v":"Appr. LNRBM-ITA                                    Pagina 1  di 8                                         Revisione n.1                                    Data:15/05/2023"}]
[]
[null,null,"LINEE GUIDA NAZIONALI"]
[null,null,"Molluschi Bivalvi Vivi"]
[]
[]
[]
["Appr. LNRBM-ITA"]
["Pagina Corrente",1]
["Pagine totali",8]
["Revisione n.",1]
["Data:","15/05/2023"]
[]
["Motivazione revisione: "]
["OGGETTO","la presente valutazione di rischio si applica in conformità al Reg UE 2019/627 TITOLO V, CAPO I articolo 61"]
[]
["DETTAGLI","in particolare vengono presi in considerazione le attività atte a garantire il rispetto dei requisiti di cui ai commi 3, 4, 5, 6,7"]
[]
["OBIETTIVO "]
["Definizione di RISCHIO"]
{"$rows_left_out":22}
{"sheet":"2_INDICE","index":1,"n_rows":20,"n_cols":9,"rows_kept":20,"cut":false,"hidden":false,"merged":[[11,2,11,4],[12,2,12,4],[13,2,13,4],[28,1,28,2],[28,4,28,5],[8,2,8,4],[9,2,9,4],[10,2,10,4],[7,2,7,4],[0,1,4,1],[0,2,0,4],[1,2,2,4],[3,2,4,4],[5,1,5,6],[0,5,4,7]]}
[null,null,{"$f":"'1_Cartiglio '!C1:Q2","v":"Valutazione del rischio (VdR)"},null,null,{"$f":"'1_Cartiglio '!$A$8&\"                                    Pagina \"&I2&\"  di \"&'1_Cartiglio '!$B$10&\"                                        \"&'1_Cartiglio '!$A$11&'1_Cartiglio '!$B$11&\"                                  \" &'1_Cartiglio '!$A$12&'1_Cartiglio '!$B$12&\"\"","v":"Appr. LNRBM-ITA                                    Pagina 2  di 8                                        Revisione n.1                                  Data:15/05/2023"}]
[null,null,{"$f":"'1_Cartiglio '!C3:Q3","v":"LINEE GUIDA NAZIONALI"},null,null,null,null,null,2]
[]
[null,null,{"$f":"'1_Cartiglio '!C4:Q5","v":"Molluschi Bivalvi Vivi"}]
[]
[null,"INDICE"]
[]
[null,"FOGLIO","DESCRIZIONE",null,null,"pagina"]
[null,"SCHEMA","indicazione del procedimento da seguire per l'applicazione della valitazione di RISCHIO",null,null,3]
[null,"INFORMAZIONI","parte da compilare a cura del soggetto che ha predisposto il Piano di Monitoraggio",null,null,4]
[null,"VdR-PdM","da compilare per la definizione del RISCHIO_ valutazione di rischio del Piano di Monitoraggio",null,null,5]
[null,"VdR_PROCESSO","da compilare per la definizione del RISCHIO_valutazione di rischio del Processo",null,null,6]
[null,"OPPORTUNITA'","da compilare_valutazione mitigazione del rischio con la predisposizione di opportuni meccanismi di controllo-prevenzione e mitigazione del rischio",null,null,7]
[null,"VERIFICA DA PARTE TERZA","da compilare a cura di ente terzo_per la CONVALIDA della valutazione di rischio",null,null,8]
[]
[null,"LEGENDA: "]
[null,"MBV= MOLLUSCHI BIVALVI VIVI"]
[null,"BM= BIOTOSSINE MARINE"]
[null,"VdR= VALUTAZIONE DEL RISCHIO"]
[null,"PdM= PIANO DI MONITORAGGIO/MONITORAGGIO"]
{"$rows_left_out":1}
{"sheet":"3_SCHEMA","index":2,"n_rows":101,"n_cols":9,"rows_kept":101,"cut":false,"hidden":false,"merged":[[5,1,5,7],[0,1,4,1],[0,2,0,4],[1,2,2,4],[3,2,4,4],[0,5,4,6]]}
[null,null,{"$f":"'1_Cartiglio '!C1:Q2","v":"Valutazione del rischio (VdR)"},null,null,{"$f":"'1_Cartiglio '!$A$8&\"                                    Pagina \"&I2&\"  di \"&'1_Cartiglio '!$B$10&\"                                        \"&'1_Cartiglio '!$A$11&'1_Cartiglio '!$B$11&\"                                  \" &'1_Cartiglio '!$A$12&'1_Cartiglio '!$B$12&\"\"","v":"Appr. LNRBM-ITA                                    Pagina 3  di 8                                        Revisione n.1                                  Data:15/05/2023"}]
[null,null,{"$f":"'1_Cartiglio '!C3:Q3","v":"LINEE GUIDA NAZIONALI"},null,null,null,null,null,3]
[]
[null,null,{"$f":"'1_Cartiglio '!C4:Q5","v":"Molluschi Bivalvi Vivi"}]
[]
[null,"SCHEMA"]
[]
[]
[]
[]
[]
[]
[]
[]
[]
[]
[]
[]
[]
[]
{"$rows_left_out":82}
{"sheet":"4-INFORMAZIONI RISULTATI AZIONI","index":3,"n_rows":55,"n_cols":10,"rows_kept":55,"cut":false,"hidden":false,"merged":[[52,1,54,1],[36,7,36,9],[41,1,41,3],[37,7,37,8],[46,1,46,6],[49,1,51,1],[0,6,4,6],[17,2,17,6],[5,1,5,6],[16,2,16,6],[15,2,15,4],[8,2,8,6],[9,2,9,6],[0,2,0,5],[1,2,2,5],[3,2,4,5],[0,1,4,1],[6,2,6,6],[7,2,7,6],[10,2,10,6],[11,2,11,6],[12,2,12,6],[19,1,19,6],[36,4,36,6],[36,1,36,3],[35,1,35,3],[13,2,13,6],[14,2,14,6],[24,1,24,5]]}
[null,null,{"$f":"'1_Cartiglio '!C1:Q2","v":"Valutazione del rischio (VdR)"},null,null,null,{"$f":"'1_Cartiglio '!$A$8&\"                                    Pagina \"&J2&\"  di \"&'1_Cartiglio '!$B$10&\"                                        \"&'1_Cartiglio '!$A$11&'1_Cartiglio '!$B$11&\"                                  \" &'1_Cartiglio '!$A$12&'1_Cartiglio '!$B$12&\"\"","v":"Appr. LNRBM-ITA                                    Pagina 4  di 8                                        Revisione n.1                                  Data:15/05/2023"}]
[null,null,{"$f":"'1_Cartiglio '!C3:Q3","v":"LINEE GUIDA NAZIONALI"},null,null,null,null,null,null,4]
[]
[null,null,{"$f":"'1_Cartiglio '!C4:Q5","v":"Molluschi Bivalvi Vivi"}]
[]
[null,"INFORMAZIONI GENERALI (DA COMPILARE)"]
[null,"IDENTIFICAZIONE DELLA AREA "]
[null,"TIPOLOGIA DI IMPIANTO"]
[null,"STAGIONALITA"]
[null,"classificazione AREA","A"]
["A","per AREA OMOGENEA elencare le STAZIONI "]
[null,"TIPOLOGIA DI ALLEVAMENTO"]
[null,"data"]
[null,"compilato da"]
[null,"validato da"]
[null,"REVISIONE n",null,null,null,"del"]
[null,"CAUSA MODIFICA/REVISIONE (dettagliare le motivazioni della revisione)"]
[null,"requisiti minimi","ANALISI DI FITOPLANCTON TOSSICO E BIOTOSSINE REGOLAMENTATE AI SENSI DEL REG 853/2004 e Reg UE 2017/625 E ss.mm.ii. (ASP, PSP, LIPOFILICHE)"]
[]
[null,"RISULTATI VALUTAZIONE DI RISCHIO"]
{"$rows_left_out":36}
{"sheet":"5-VdR_PdM","index":4,"n_rows":21,"n_cols":20,"rows_kept":21,"cut":false,"hidden":false,"merged":[[0,11,4,14],[20,10,20,11],[6,1,6,2],[0,1,4,1],[10,1,12,1],[8,3,8,5],[8,6,8,8],[8,9,8,11],[8,12,8,14],[6,3,6,4],[0,2,0,10],[1,2,1,10],[2,2,4,10]]}
[null,null,{"$f":"'1_Cartiglio '!C1:Q2","v":"Valutazione del rischio (VdR)"},null,null,null,null,null,null,null,null,{"$f":"'1_Cartiglio '!$A$8&\"                                                                                      Pagina \"&R2&\"  di \"&'1_Cartiglio '!$B$10&\"                                                                                             \"&'1_Cartiglio '!$A$11&'1_Cartiglio '!$B$11&\"                                                                                              \" &'1_Cartiglio '!$A$12&'1_Cartiglio '!$B$12&\"\"","v":"Appr. LNRBM-ITA                                                                                      Pagina 5  di 8                                                                                             Revisione n.1                                                                                              Data:15/05/2023"}]
[null,null,{"$f":"'1_Cartiglio '!C3:Q3","v":"LINEE GUIDA NAZIONALI"},null,null,null,null,null,null,null,null,null,null,null,null,null,null,5]
[null,null,"Molluschi Bivalvi Vivi"]
[]
[]
[]
[null,"PROCESSO:                     definizione del PdM",null,"processo decisionale"]
[]
[null,"PUNTI CRITICI DEL PROCESSO",null,"ATTIVITA CONSIDERATE",null,null,"ESECUZIONE ATTIVITA'",null,null,"ATTIVITA' IMPLEMENTATE A SUPPORTO ",null,null,"OSA ",null,null,"contributo","RISCHIO VALUTATO DA PdM"]
["A","PIANO DI MONITORAGGIO (PdM)",null,null,"(COLONNA DA COMPILARE SELEZIONANDO DAL MENU A TENDINA)",null,null,"(COLONNA DA COMPILARE SELEZIONANDO DAL MENU A TENDINA)",null,null,"(COLONNA DA COMPILARE SELEZIONANDO DAL MENU A TENDINA)",null,null,"(COLONNA DA COMPILARE SELEZIONANDO DAL MENU A TENDINA)",null,"%"]
[null,"PRODUZIONE REGOLARE E CONTINUATIVA","P1","Campionamento segue una programmazione annuale",null,{"$f":"IF(E11=\"SI\",1,IF(E11=\"NO\",10,\"\"))","v":""},"Campionamento viene eseguito con cadenza",null,{"$f":"IF(H11=\"\",\"\",VLOOKUP(H11,Foglio1!$D$3:$G$7,2,0))","v":""},"Campionamento Fitoplancton",null,{"$f":"IF(K11=\"\",\"\",VLOOKUP('5-VdR_PdM'!K11,'5-VdR_PdM'!S11:T12,2,0))","v":""},"Importanza commerciale dell'area ",null,{"$f":"IF(N11=\"\",\"\",(IF(N11=\"area a media o alta produttività\",2,1.8)))","v":""},10,{"$f":"IFERROR(F11*I11*L11*O11*P11,\"NON CLASSIFICATO\")","v":"NON CLASSIFICATO"},null,"PREVISTO",1]
[null,null,null,null,null,null,null,null,null,null,null,null,null,null,null,null,null,null,"NON PREVISTO",100]
[null,null,"P2","nella fase di programmazione del monitoraggio sono state prese in considerazione le seguenti informazioni relative alla area: ciclo produttivo e durata , produzione, eventuale fermo pesca; periodo di raccolta",null,{"$f":"IF(E13=\"SI\",1,IF(E13=\"NO\",7,\"\"))","v":""},"nel caso di condizioni meteo avverse o in caso di impossibilità ad eseguire il campionamento ",null,{"$f":"IF(H13=\"\",\"\",IF(H13=\"campionamento annullato\",20,1))","v":""},null,null,null,"I campioni in autocontrollo (OSA) sono numericamente significativi ai fini del controllo dell'Area di produzione?",null,{"$f":"IF(N13=\"\",\"\",IF(N13=\"SI\",1,2))","v":""},3,{"$f":"IFERROR(F13*I13*O13*P13,\"NON CLASSIFICATO\")","v":"NON CLASSIFICATO"}]
[null,"SPECIE CAMPIONATA","P3"," Capacità di filtrazione (alto  o basso potere filtrante)",null,{"$f":"IF(E14=\"\",\"\",VLOOKUP(E14,Foglio1!D27:E29,2,0))","v":""},"la specie campionata coincide con la specie indicatore",null,{"$f":"IF(H14=\"\",\"\",IF(H14=\"SI\",1,2))","v":""},"nel caso di presenza di BM nella specie indicatore, come vengono gestite le altre specie eventualmente presenti",null,{"$f":"IF(K14=\"\",\"\",VLOOKUP(K14,Foglio1!$N$8:$O$10,2,0))","v":""},null,null,null,null,{"$f":"IFERROR(F14*I14*L14,\"NON CLASSIFICATO\")","v":"NON CLASSIFICATO"}]
[null,"VALUTAZIONE RISCHIO DA PIANO DI MONITORAGGIO",null,{"$f":"IFERROR(Q16,\"\")","v":""},null,null,null,null,null,null,null,null,null,null,null,null,{"$f":"IFERROR(Q11+Q13+Q14,\"\")","v":""}]
[null,"CLASSIFICAZIONE DI RISCHIO",null,{"$f":"IF(D15=\"\",\"\",(IF(D15<200,\"BASSO\",IF(Q16<450,\"MEDIO\",\"ELEVATO\"))))","v":""},null,null,null,null,null,null,null,null,null,null,null,null,{"$f":"IF(AND(H11=\"settimanale\",H13=\"campionamento annullato\"),MAX(210,Q15),Q15)","v":""}]
[]
[]
[]
[]
{"$rows_left_out":2}
{"sheet":"6-VdR_processo","index":5,"n_rows":68,"n_cols":13,"rows_kept":68,"cut":false,"hidden":false,"merged":[[54,1,54,2],[49,1,49,2],[62,8,62,10],[31,0,31,10],[0,1,4,1],[0,9,4,10],[0,2,0,8],[1,2,2,8],[3,2,4,8],[28,1,28,2],[19,1,19,2],[22,1,22,2],[23,1,23,2],[47,1,47,2],[38,1,38,2],[37,1,37,2],[43,1,43,2],[45,1,45,2],[46,1,46,2],[27,1,27,2],[44,1,44,2],[39,1,39,10],[36,1,36,2],[34,1,34,2],[35,1,35,2],[33,1,33,2],[26,1,26,2],[20,1,20,2],[11,1,11,2],[15,1,15,2],[16,1,16,2],[21,1,21,2],[14,1,14,2],[67,5,67,6],[8,7,8,10],[8,3,8,5],[32,1,32,10],[11,10,11,11],[8,1,8,2],[9,1,9,2],[10,1,10,2],[13,1,13,2],[18,1,18,2],[17,1,17,2],[30,1,30,2],[24,1,24,2],[25,1,25,2],[63,1,63,10],[12,1,12,2]]}
[null,null,{"$f":"'1_Cartiglio '!C1:Q2","v":"Valutazione del rischio (VdR)"},null,null,null,null,null,null,{"$f":"'1_Cartiglio '!$A$8&\"                                    Pagina \"&M2&\"  di \"&'1_Cartiglio '!$B$10&\"                                        \"&'1_Cartiglio '!$A$11&'1_Cartiglio '!$B$11&\"                                  \" &'1_Cartiglio '!$A$12&'1_Cartiglio '!$B$12&\"\"","v":"Appr. LNRBM-ITA                                    Pagina 6  di 8                                        Revisione n.1                                  Data:15/05/2023"}]
[null,null,{"$f":"'1_Cartiglio '!C3:Q3","v":"LINEE GUIDA NAZIONALI"},null,null,null,null,null,null,null,null,null,6]
[]
[null,null,{"$f":"'1_Cartiglio '!C4:Q5","v":"Molluschi Bivalvi Vivi"}]
[]
[]
[null,"PROCESSO: CAMPIONAMENTO E ANALISI"]
[]
[null,"PUNTI CRITICI DEL PROCESSO",null,"ATTIVITA CONSIDERATE",null,null,null,"ESECUZIONE ATTIVITA'"]
[null,null,null,"descrizione attivita","applicazione","valutazione ","valutazione  II livello","dettaglio della attività","applicaszione","valutazione","output atteso"]
[null,null,null,null,"(COLONNA DA COMPILARE SELEZIONANDO DAL MENU A TENDINA)",null,null,null,"(COLONNA DA COMPILARE SELEZIONANDO DAL MENU A TENDINA)"]
[null,"VALUTAZIONE CAMPIONAMENTO",null,null,null,null,null,null,null,null,"torna al CARTIGLIO"]
["V1","LOCALIZZAZIONE DEI PUNTI DI CAMPIONAMENTO"]
["V1-A","INFORMAZIONI NECESSARIE"]
[null,null,null,"i punti di campionamento sono ben identificati e georeferenziati",null,{"$f":"IF(E15=\"\",\"\",IF(E15=\"NO\",50,5))","v":""},{"$f":"F15","v":""}]
[null,null,null,"Possibilità di campionamento di acqua e molluschi nella stessa area, ",null,{"$f":"IF(E16=\"\",\"\",VLOOKUP(E16,Foglio1!$D$10:$E$12,2,0))","v":""},{"$f":"F16","v":""}]
[null,null,null,"esistenza di Stazioni “sentinella” monitorate con frequenza ridotta",null,{"$f":"IF(E17=\"\",\"\",VLOOKUP(E17,Foglio1!$D$10:$E$12,2,0))","v":""},{"$f":"F17","v":""}]
[null,"V1-A VALUTAZIONE RISCHIO",null,{"$f":"IFERROR(ROUND((IF(E15=\"NO\",MAXA(51,F18),F18)*G29),0),\"\")","v":""},null,{"$f":"IFERROR(G15*AVERAGE(G16:G17),\"NON APPLICABILE\")","v":"NON APPLICABILE"}]
["V1-B","INFORMAZIONI AGGIUNTIVE ACCESSORIE"]
[null," si vuole compilare le seguenti voci"]
{"$rows_left_out":49}
{"sheet":"7-OPPORTUNITA","index":6,"n_rows":42,"n_cols":14,"rows_kept":42,"cut":false,"hidden":false,"merged":[[0,3,1,9],[2,3,2,9],[3,3,4,9],[0,10,4,11],[0,1,4,2],[8,1,8,11],[17,1,17,11],[16,1,16,11],[9,2,9,11],[18,2,18,11],[41,2,41,3],[27,2,27,3],[23,1,23,3],[15,1,15,3],[24,1,24,11]]}
[null,null,null,"Valutazione del rischio (VdR)",null,null,null,null,null,null,{"$f":"'1_Cartiglio '!$A$8&\"                                    Pagina \"&N2&\"  di \"&'1_Cartiglio '!$B$10&\"                                        \"&'1_Cartiglio '!$A$11&'1_Cartiglio '!$B$11&\"                                  \" &'1_Cartiglio '!$A$12&'1_Cartiglio '!$B$12&\"\"","v":"Appr. LNRBM-ITA                                    Pagina 7  di 8                                        Revisione n.1                                  Data:15/05/2023"}]
[null,null,null,null,null,null,null,null,null,null,null,null,null,7]
[null,null,null,"LINEE GUIDA NAZIONALI"]
[null,null,null,"Molluschi Bivalvi Vivi"]
[]
[]
[]
[null,"ATTIVITA' IMPLEMENTATA","AZIONE","APPLICAZIONE","VALUTAZIONE","VALUTAZIONE COMPLESSIVA","ATTIVITA' SUPPORTO 1","APPLICAZIONE","VALUTAZIONE","ATTIVITA' SUPPORTO 2","APPLICAZIONE","VALUTAZIONE"]
["O1","O1-VALUTAZIONE DATI STORICI E TREND FITOPLANCTON e  BIOTOSSINE MARINE"]
[null,"Obiettivo","inserire nel processo di VdR una fase di indagine preliminare basata sulla valutazione dei dati disponibili e sulle rilevanze ottenute  al fine di ridurre il rischio derivante dalla pianificazione del monitoraggio e della frequenza di campionamento"]
[null,"UTILIZZO DATI STORICI PER LA DEFINZIONE DELLE FREQUENZE","sono disponibili Informazioni storiche di base tra cui i dati delle tossine e delle specie algali tossiche rilevate",null,{"$f":"IF(D11=\"\",\"\",IF(D11=\"SI\",1,0))","v":""},{"$f":"E11","v":""}]
[null,"da compilare solo nel caso in cui O1_SI","esistono dei dati storici relativi ad almeno tre anni consecutivi  in cui si evidenzia che per determinati periodi non è stato registrato alcun evento di fioritura tossico o presenza di biotossine marine; ",null,{"$f":"IF(D12=\"\",\"\",VLOOKUP(D12,Foglio1!$D$10:$G$12,4,0))","v":""},{"$f":"IFERROR(E12/(I12*I13*I14),\"\")","v":""},"• I dati storici sono tali da definire un trend e individuare dei periodi di “rischio”",null,{"$f":"IF(H12=\"\",\"\",IF(H12=\"\",\"\",VLOOKUP(H12,Foglio1!D10:F12,3,0)))","v":""}]
[null,null,null,null,null,null,"i dati storici consentono di fare delle previsioni  (es: tempo impiegato dal MB a accumulare la tossina etc)",null,{"$f":"IF(H13=\"\",\"\",IF(H13=\"\",\"\",VLOOKUP(H13,Foglio1!D10:F12,3,0)))","v":""}]
[null,null,null,null,null,null,"i dati storici raccolti sono stati utilizzati per la definizione della frequenza di campionamento ",null,{"$f":"IF(H14=\"\",\"\",VLOOKUP(H14,Foglio1!D10:F13,3,0))","v":""}]
[null,null,"in caso di sospensione del campionamento  per un certo periodo in relazione a valutazioni condotte su dati storici viene garantito il campionamento di almeno 1 pto per la raccolta dati - della specie “indicatrici” sentinella ",null,{"$f":"IF(D15=\"\",\"\",VLOOKUP(D15,Foglio1!$D$10:$H$12,5,0))","v":""},{"$f":"IFERROR(E15/I15,\"\")","v":""},"il campionamento del punto sentinella viene effettuato con una cadenza",null,{"$f":"IF(D15=\"NO\",1,IF(H15=\"\",\"\",IF(D15=\"si\",VLOOKUP(H15,Foglio1!D58:E61,2,0),1)))","v":""}]
["O1","VALUTAZIONE DATI STORICI",null,null,{"$f":"F16","v":"errore di Compilazione"},{"$f":"IF(AND(D12<>\"\",D15<>\"\"),(IFERROR(AVERAGE(F12:F15),\"\")),\"errore di Compilazione\")","v":"errore di Compilazione"}]
[]
["O2","SISTEMI DI EARLY WARNING"]
[null,"obiettivo","implementare un sistema di early warning che consente di intercettare l'evento tossico e di gestire la criticita al fine di adottare un piano di monitoraggio flessibile in termini di frequenza di campionamento "]
[null,"implementazione DI UN SISTEMA DI EARLY WARNING  SUPPORTO DELLE ATTIVITA DI MONITORAGGIO","ESISTENZA DI SISTEMI DI EARLY WARNING (da dettagliare)",null,{"$f":"IF(D20=\"\",\"\",VLOOKUP(D20,Foglio1!$D$10:$G$12,4,0))","v":""},{"$f":"IFERROR(IF(D20=\"NO\",1,E20/I20),\"\")","v":""},"i sistemi di early warning si basano su dati di trend",null,{"$f":"IF(H20=\"\",\"\",IF(D20=\"SI\",VLOOKUP(H20,Foglio1!D41:E44,2,0),1))","v":""}]
{"$rows_left_out":23}
{"sheet":"8-VERIFICA PARTE TERZA_BOZZA ","index":7,"n_rows":46,"n_cols":14,"rows_kept":46,"cut":false,"hidden":false,"merged":[[19,2,19,6],[12,2,12,6],[13,2,13,6],[14,2,14,6],[15,2,15,6],[16,2,16,6],[0,1,4,2],[0,3,1,11],[2,3,2,11],[3,3,4,11],[6,1,10,2],[6,3,7,9],[6,10,10,11],[8,3,8,9],[9,3,10,9]]}
[]
[]
[]
[]
[]
[]
[null,null,null,"Valutazione del rischio (VdR)",null,null,null,null,null,null,{"$f":"'1_Cartiglio '!$A$8&\"                                    Pagina \"&N8&\"  di \"&'1_Cartiglio '!$B$10&\"                                        \"&'1_Cartiglio '!$A$11&'1_Cartiglio '!$B$11&\"                                  \" &'1_Cartiglio '!$A$12&'1_Cartiglio '!$B$12&\"\"","v":"Appr. LNRBM-ITA                                    Pagina 8  di 8                                        Revisione n.1                                  Data:15/05/2023"}]
[null,null,null,null,null,null,null,null,null,null,null,null,null,8]
[null,null,null,"LINEE GUIDA NAZIONALI"]
[null,null,null,"Molluschi Bivalvi Vivi"]
[]
[]
[null,"AUTORITA'/ENTE"]
[null,"PERSONALE incaricato"]
[null,"RUOLO"]
[null,"DATA"]
["A","NOTE"]
[]
[]
[null,"PROCEDURA DI VALUTAZIONE DOPO ","(indicare dopo quanto tempo dalla data del PdM è stata fatta la verifica)"]
{"$rows_left_out":27}
{"sheet":"Foglio1","index":8,"n_rows":96,"n_cols":15,"rows_kept":96,"cut":false,"hidden":true,"merged":[]}
[]
[]
[null,null,null,"< settimanale",0.5,200,25,null,null,null,null,null,null,"campionamento rimandato secondo tempistiche consone",1]
[null,null,null,"settimanale",3,100,50,null,null,null,null,null,null,"campionamento annullato",20]
[null,null,null,"<=15 gg",25,50,100]
[null,null,null,"mensile",50,10,125]
[null,null,null,">30 gg",100,5,150]
[null,null,null,null,null,null,null,null,null,null,null,null,null,"si provvede a campionare le altre specie",1]
[null,null,null,1,2,3,4,5,6,7,null,null,null,"si vieta la raccolta",2]
[null,null,null,"SI",1,2,0.5,0.5,100,0.5,null,null,null,"non so",3]
[null,null,null,"NO",5,1,100,1,0.5,50]
[null,null,null,"non so",20,1,100,1,100,100]
[null,null,null,"non rilevante",2,0.5,100,1,100,50]
[]
[null,null,null,"< 3 anni",1,3,0.05]
[null,null,null,"> 3 anni",3,1,1]
[null,null,null,"NON SO",0.1,0.1,0.05]
[]
[]
[null,null,null,"rappresentativo della colonna d'acqua (quant)",1]
{"$rows_left_out":77}
{"sheet":"modifiche","index":9,"n_rows":8,"n_cols":7,"rows_kept":8,"cut":false,"hidden":true,"merged":[]}
[]
[]
[]
[null,null,"da inserrie:"]
[]
[null,null,"VdR piano"]
[null,null,"inserire"]
[null,null,"titpologia ssitema di allevamento",null,null,null,"a resta; lanterna; "]

{"sheet":"RIASSUNTO","index":10,"n_rows":27,"n_cols":14,"rows_kept":27,"cut":false,"hidden":true,"merged":[]}
[]
[]
[]
[]
[]
[null,null,null,null,"GRAVITA","PROBABILITA","RIVELABILITA'",null,null,null,null,"GRAVITA","PROBABILITA","RIVELABILITA'"]
[null,null,10,"10-9","ESTREMO","FREQUENTE","QUASI IMPOSSIBILE",null,null,null,10,"ESTREMO","FREQUENTE","QUASI IMPOSSIBILE"]
[null,null,9,null,"ESTREMO","FREQUENTE","QUASI IMPOSSIBILE",null,null,null,9,"ESTREMO","FREQUENTE","QUASI IMPOSSIBILE"]
[null,null,8,"8-7","MOLTO ALTO","PROBABILE","REMOTA",null,null,null,8,"MOLTO ALTO","PROBABILE","REMOTA"]
[null,null,7,null,"MOLTO ALTO","PROBABILE","REMOTA",null,null,null,7,"MOLTO ALTO","PROBABILE","REMOTA"]
[null,null,6,"6-5","ALTO","OCCASIONALE","BASSA",null,null,null,6,"ALTO","OCCASIONALE","BASSA"]
[null,null,5,null,"ALTO","OCCASIONALE","BASSA",null,null,null,5,"ALTO","OCCASIONALE","BASSA"]
[null,null,4,"4-3","MODERATO","REMOTA","ALTA",null,null,null,4,"MODERATO","REMOTA","ALTA"]
[null,null,3,null,"MODERATO","REMOTA","ALTA",null,null,null,3,"MODERATO","REMOTA","ALTA"]
[null,null,2,"2-1","LIEVE","IMPROBABILE","QUASI CERTA",null,null,null,2,"LIEVE","IMPROBABILE","QUASI CERTA"]
[null,null,1,null,"LIEVE","IMPROBABILE","QUASI CERTA",null,null,null,1,"LIEVE","IMPROBABILE","QUASI CERTA"]
[]
[]
[null,null,"0-150","BASSO"]
[null,null,"151-300","MEDIO"]
{"$rows_left_out":7}